WordPress

Briefly unavailable for scheduled maintenance.
Check back in a some hours.
Uname:Linux wp 4.15.0-213-generic #224-Ubuntu SMP Mon Jun 19 13:30:12 UTC 2023 x86_64

Base Dir : /var/www/eduesan

User : www-data


403WebShell
403Webshell
Server IP : 202.131.237.196  /  Your IP : 216.73.216.192
Web Server : nginx/1.14.0
System : Linux wp 4.15.0-213-generic #224-Ubuntu SMP Mon Jun 19 13:30:12 UTC 2023 x86_64
User : www-data ( 33)
PHP Version : 7.2.24-0ubuntu0.18.04.17
Disable Function : pcntl_alarm,pcntl_fork,pcntl_waitpid,pcntl_wait,pcntl_wifexited,pcntl_wifstopped,pcntl_wifsignaled,pcntl_wifcontinued,pcntl_wexitstatus,pcntl_wtermsig,pcntl_wstopsig,pcntl_signal,pcntl_signal_get_handler,pcntl_signal_dispatch,pcntl_get_last_error,pcntl_strerror,pcntl_sigprocmask,pcntl_sigwaitinfo,pcntl_sigtimedwait,pcntl_exec,pcntl_getpriority,pcntl_setpriority,pcntl_async_signals,
MySQL : OFF  |  cURL : ON  |  WGET : ON  |  Perl : ON  |  Python : ON  |  Sudo : ON  |  Pkexec : ON
Directory :  /www/server/php/72/src/Zend/tests/

Upload File :
current_dir [ Writeable ] document_root [ Writeable ]

 

Command :


[ Back ]     

Current File : /www/server/php/72/src/Zend/tests//get_defined_functions_basic.phpt
--TEST--
get_defined_functions() function : basic functionality
--FILE--
<?php

/* Prototype  : array get_defined_functions  ( void  )
 * Description: Gets an array of all defined functions.
 * Source code: Zend/zend_builtin_functions.c
*/

echo "*** Testing get_defined_functions() : basic functionality ***\n";

function foo() {}

// mixed case function
function HelloWorld() {}

Class C {
	function f1() {}
	static function f2() {}
}

$func = get_defined_functions();

if (!is_array($func)) {
	echo "TEST FAILED: return type not an array\n";
}


if (!is_array($func["internal"])) {
 	echo "TEST FAILED: no element in result array with key 'internal'\n";
}

$internal = $func["internal"];

//check for a few core functions
if (!in_array("cos", $internal) || !in_array("strlen", $internal)) {
 	echo "TEST FAILED: missing elements from 'internal' array\n";
 	var_dump($internal);
}

if (!is_array($func["user"])) {
 	echo "TEST FAILED: no element in result array with key 'user'\n";
}

$user = $func["user"];
if (count($user) == 2 && in_array("foo", $user) && in_array("helloworld", $user)) {
	echo "TEST PASSED\n";
} else {
	echo "TEST FAILED: missing elements from 'user' array\n";
	var_dump($user);
}

?>
===Done===
--EXPECT--
*** Testing get_defined_functions() : basic functionality ***
TEST PASSED
===Done===

Youez - 2016 - github.com/yon3zu
LinuXploit